Reaction Details
TargetDual specificity tyrosine-phosphorylation-regulated kinase 3
LigandBDBM50021616
Substrate/Competitorn/a
Meas. Tech.ChEMBL_1367663 (CHEMBL3299314)
IC50 1200±n/a nM
Citation Beniddir, MALe Borgne, EIorga, BILoaëc, NLozach, OMeijer, LAwang, KLitaudon, M Acridone alkaloids from Glycosmis chlorosperma as DYRK1A inhibitors. J Nat Prod77:1117-22 (2014) 
 
Dual specificity tyrosine-phosphorylation-regulated kinase 3
Name:Dual specificity tyrosine-phosphorylation-regulated kinase 3
Type:PROTEIN
Mol. Mass.:65747.26
Organism:Homo sapiens (Human)
Description:ChEMBL_1508026
Residue:588
BDBM50021616
NameBDBM50021616
Synonyms:CHEMBL3297832
TypeSmall organic molecule
Emp. Form.C19H17NO5
Mol. Mass.339.342
SMILESCOc1c(O)ccc2c1[nH]c1c3C=CC(C)(C)Oc3cc(O)c1c2=O