Reaction Details
TargetSerine/threonine-protein kinase pim-2
LigandBDBM50021624
Substrate/Competitorn/a
Meas. Tech.ChEMBL_1367999 (CHEMBL3300844)
IC50 36±n/a nM
Citation Casuscelli, FArdini, EAvanzi, NCasale, ECervi, GD'Anello, MDonati, DFaiardi, DFerguson, RDFogliatto, GGalvani, AMarsiglio, AMirizzi, DGMontemartini, MOrrenius, CPapeo, GPiutti, CSalom, BFelder, ER Discovery and optimization of pyrrolo[1,2-a]pyrazinones leads to novel and selective inhibitors of PIM kinases. Bioorg Med Chem21:7364-80 (2013) 
 
Serine/threonine-protein kinase pim-2
Name:Serine/threonine-protein kinase pim-2
Type:Serine/threonine-protein kinase
Mol. Mass.:34185.93
Organism:Homo sapiens (Human)
Description:Q9P1W9
Residue:311
BDBM50021624
NameBDBM50021624
Synonyms:CHEMBL3297766 | US9145418, 23
TypeSmall organic molecule
Emp. Form.C30H42ClN5O2
Mol. Mass.540.14
SMILESCN(C)C1CCN(C[C@@H](NC(=O)C[C@H]2CNC(=O)c3cc(cn23)-c2cccc(Cl)c2)C2CCCCC2)CC1