Reaction Details
TargetHigh affinity immunoglobulin gamma Fc receptor I
LigandBDBM50021618
Substrate/Competitorn/a
Meas. Tech.ChEMBL_1368037 (CHEMBL3300964)
IC50>10000±n/a nM
Citation Casuscelli, FArdini, EAvanzi, NCasale, ECervi, GD'Anello, MDonati, DFaiardi, DFerguson, RDFogliatto, GGalvani, AMarsiglio, AMirizzi, DGMontemartini, MOrrenius, CPapeo, GPiutti, CSalom, BFelder, ER Discovery and optimization of pyrrolo[1,2-a]pyrazinones leads to novel and selective inhibitors of PIM kinases. Bioorg Med Chem21:7364-80 (2013) 
 
High affinity immunoglobulin gamma Fc receptor I
Name:High affinity immunoglobulin gamma Fc receptor I
Type:PROTEIN
Mol. Mass.:42639.35
Organism:Homo sapiens (Human)
Description:ChEMBL_1446762
Residue:374
BDBM50021618
NameBDBM50021618
Synonyms:CHEMBL3297762 | US9145418, 2
TypeSmall organic molecule
Emp. Form.C28H38ClN5O2
Mol. Mass.512.087
SMILESCN1CCN(C[C@@H](NC(=O)C[C@H]2CNC(=O)c3cc(cn23)-c2cccc(Cl)c2)C2CCCCC2)CC1