Reaction Details
TargetTyrosine-protein kinase JAK3
LigandBDBM50021626
Substrate/Competitorn/a
Meas. Tech.ChEMBL_1368032 (CHEMBL3300959)
IC50>10000±n/a nM
Citation Casuscelli, FArdini, EAvanzi, NCasale, ECervi, GD'Anello, MDonati, DFaiardi, DFerguson, RDFogliatto, GGalvani, AMarsiglio, AMirizzi, DGMontemartini, MOrrenius, CPapeo, GPiutti, CSalom, BFelder, ER Discovery and optimization of pyrrolo[1,2-a]pyrazinones leads to novel and selective inhibitors of PIM kinases. Bioorg Med Chem21:7364-80 (2013) 
 
Tyrosine-protein kinase JAK3
Name:Tyrosine-protein kinase JAK3
Type:Protein
Mol. Mass.:125111.08
Organism:Homo sapiens (Human)
Description:P52333
Residue:1124
BDBM50021626
NameBDBM50021626
Synonyms:CHEMBL3298400
TypeSmall organic molecule
Emp. Form.C18H23N3O2S
Mol. Mass.345.459
SMILESCC(C)(C)CNC(=O)CC1CNC(=O)c2cc(cn12)-c1ccsc1