Reaction Details
TargetSerine/threonine-protein kinase PLK1
LigandBDBM50021626
Substrate/Competitorn/a
Meas. Tech.ChEMBL_1368015 (CHEMBL3300860)
IC50>10000±n/a nM
Citation Casuscelli, FArdini, EAvanzi, NCasale, ECervi, GD'Anello, MDonati, DFaiardi, DFerguson, RDFogliatto, GGalvani, AMarsiglio, AMirizzi, DGMontemartini, MOrrenius, CPapeo, GPiutti, CSalom, BFelder, ER Discovery and optimization of pyrrolo[1,2-a]pyrazinones leads to novel and selective inhibitors of PIM kinases. Bioorg Med Chem21:7364-80 (2013) 
 
Serine/threonine-protein kinase PLK1
Name:Serine/threonine-protein kinase PLK1
Type:Serine/threonine-protein kinase
Mol. Mass.:68277.16
Organism:Homo sapiens (Human)
Description:P53350
Residue:603
BDBM50021626
NameBDBM50021626
Synonyms:CHEMBL3298400
TypeSmall organic molecule
Emp. Form.C18H23N3O2S
Mol. Mass.345.459
SMILESCC(C)(C)CNC(=O)CC1CNC(=O)c2cc(cn12)-c1ccsc1