Reaction Details
TargetTyrosine-protein kinase SYK
LigandBDBM50021618
Substrate/Competitorn/a
Meas. Tech.ChEMBL_1368009 (CHEMBL3300854)
IC50>10000±n/a nM
Citation Casuscelli, FArdini, EAvanzi, NCasale, ECervi, GD'Anello, MDonati, DFaiardi, DFerguson, RDFogliatto, GGalvani, AMarsiglio, AMirizzi, DGMontemartini, MOrrenius, CPapeo, GPiutti, CSalom, BFelder, ER Discovery and optimization of pyrrolo[1,2-a]pyrazinones leads to novel and selective inhibitors of PIM kinases. Bioorg Med Chem21:7364-80 (2013) 
 
Tyrosine-protein kinase SYK
Name:Tyrosine-protein kinase SYK
Type:Enzyme
Mol. Mass.:72079.99
Organism:Homo sapiens (Human)
Description:P43405
Residue:635
BDBM50021618
NameBDBM50021618
Synonyms:CHEMBL3297762 | US9145418, 2
TypeSmall organic molecule
Emp. Form.C28H38ClN5O2
Mol. Mass.512.087
SMILESCN1CCN(C[C@@H](NC(=O)C[C@H]2CNC(=O)c3cc(cn23)-c2cccc(Cl)c2)C2CCCCC2)CC1