Reaction Details
TargetSerine/threonine-protein kinase pim-1
LigandBDBM50021642
Substrate/Competitorn/a
Meas. Tech.ChEMBL_1368150 (CHEMBL3301295)
IC50 125±n/a nM
Citation Casuscelli, FArdini, EAvanzi, NCasale, ECervi, GD'Anello, MDonati, DFaiardi, DFerguson, RDFogliatto, GGalvani, AMarsiglio, AMirizzi, DGMontemartini, MOrrenius, CPapeo, GPiutti, CSalom, BFelder, ER Discovery and optimization of pyrrolo[1,2-a]pyrazinones leads to novel and selective inhibitors of PIM kinases. Bioorg Med Chem21:7364-80 (2013) 
 
Serine/threonine-protein kinase pim-1
Name:Serine/threonine-protein kinase pim-1
Type:Protein
Mol. Mass.:35681.82
Organism:Homo sapiens (Human)
Description:P11309
Residue:313
BDBM50021642
NameBDBM50021642
Synonyms:CHEMBL3298824
TypeSmall organic molecule
Emp. Form.C20H17F2N3O3
Mol. Mass.385.3641
SMILESFc1ccc(cc1F)-c1cc2C(=O)NCC(CC(=O)NCc3ccco3)n2c1