Reaction Details
TargetTyrosine-protein kinase ZAP-70
LigandBDBM50021626
Substrate/Competitorn/a
Meas. Tech.ChEMBL_1368005 (CHEMBL3300850)
IC50>10000±n/a nM
Citation Casuscelli, FArdini, EAvanzi, NCasale, ECervi, GD'Anello, MDonati, DFaiardi, DFerguson, RDFogliatto, GGalvani, AMarsiglio, AMirizzi, DGMontemartini, MOrrenius, CPapeo, GPiutti, CSalom, BFelder, ER Discovery and optimization of pyrrolo[1,2-a]pyrazinones leads to novel and selective inhibitors of PIM kinases. Bioorg Med Chem21:7364-80 (2013) 
 
Tyrosine-protein kinase ZAP-70
Name:Tyrosine-protein kinase ZAP-70
Type:Enzyme
Mol. Mass.:69881.61
Organism:Homo sapiens (Human)
Description:ZAP-70 SH2 domain was expressed and purified from E. coli using O-phospho-L-tyrosine-agarose column.
Residue:619
BDBM50021626
NameBDBM50021626
Synonyms:CHEMBL3298400
TypeSmall organic molecule
Emp. Form.C18H23N3O2S
Mol. Mass.345.459
SMILESCC(C)(C)CNC(=O)CC1CNC(=O)c2cc(cn12)-c1ccsc1