Reaction Details
TargetSerine/threonine-protein kinase pim-2
LigandBDBM50021644
Substrate/Competitorn/a
Meas. Tech.ChEMBL_1367999 (CHEMBL3300844)
IC50 2406±n/a nM
Citation Casuscelli, FArdini, EAvanzi, NCasale, ECervi, GD'Anello, MDonati, DFaiardi, DFerguson, RDFogliatto, GGalvani, AMarsiglio, AMirizzi, DGMontemartini, MOrrenius, CPapeo, GPiutti, CSalom, BFelder, ER Discovery and optimization of pyrrolo[1,2-a]pyrazinones leads to novel and selective inhibitors of PIM kinases. Bioorg Med Chem21:7364-80 (2013) 
 
Serine/threonine-protein kinase pim-2
Name:Serine/threonine-protein kinase pim-2
Type:Serine/threonine-protein kinase
Mol. Mass.:34185.93
Organism:Homo sapiens (Human)
Description:Q9P1W9
Residue:311
BDBM50021644
NameBDBM50021644
Synonyms:CHEMBL3298887
TypeSmall organic molecule
Emp. Form.C20H17ClFN3O3
Mol. Mass.401.819
SMILESFc1ccc(Cl)cc1-c1cc2C(=O)NCC(CC(=O)NCc3ccco3)n2c1