Reaction Details
TargetSerine/threonine-protein kinase pim-2
LigandBDBM50021652
Substrate/Competitorn/a
Meas. Tech.ChEMBL_1367999 (CHEMBL3300844)
IC50 684±n/a nM
Citation Casuscelli, FArdini, EAvanzi, NCasale, ECervi, GD'Anello, MDonati, DFaiardi, DFerguson, RDFogliatto, GGalvani, AMarsiglio, AMirizzi, DGMontemartini, MOrrenius, CPapeo, GPiutti, CSalom, BFelder, ER Discovery and optimization of pyrrolo[1,2-a]pyrazinones leads to novel and selective inhibitors of PIM kinases. Bioorg Med Chem21:7364-80 (2013) 
 
Serine/threonine-protein kinase pim-2
Name:Serine/threonine-protein kinase pim-2
Type:Serine/threonine-protein kinase
Mol. Mass.:34185.93
Organism:Homo sapiens (Human)
Description:Q9P1W9
Residue:311
BDBM50021652
NameBDBM50021652
Synonyms:CHEMBL3297758
TypeSmall organic molecule
Emp. Form.C24H24FN3O3
Mol. Mass.421.4641
SMILESOC[C@H](Cc1ccccc1)NC(=O)C[C@H]1CNC(=O)c2cc(cn12)-c1cccc(F)c1