Reaction Details
TargetTyrosine-protein kinase JAK1
LigandBDBM50021656
Substrate/Competitorn/a
Meas. Tech.ChEMBL_1368152 (CHEMBL3301297)
IC50 4.0±n/a nM
Citation Clark, JDFlanagan, METelliez, JB Discovery and development of Janus kinase (JAK) inhibitors for inflammatory diseases. J Med Chem57:5023-38 (2014) 
 
Tyrosine-protein kinase JAK1
Name:Tyrosine-protein kinase JAK1
Type:Protein
Mol. Mass.:133293.73
Organism:Homo sapiens (Human)
Description:P23458
Residue:1154
BDBM50021656
NameBDBM50021656
Synonyms:BARICITINIB LY-3009104 US10766894, Compound TABLE 1.19 US11203595, TABLE 1.19 US20230416237, Example baricitinib
TypeSmall organic molecule
Emp. Form.C16H17N7O2S
Mol. Mass.371.417
SMILESCCS(=O)(=O)N1CC(CC#N)(C1)n1cc(cn1)-c1ncnc2[nH]ccc12