Reaction Details
TargetNon-receptor tyrosine-protein kinase TYK2/Tyrosine-protein kinase JAK1
LigandBDBM50193995
Substrate/Competitorn/a
Meas. Tech.ChEMBL_1368159 (CHEMBL3299207)
IC50 35±n/a nM
Citation Clark, JDFlanagan, METelliez, JB Discovery and development of Janus kinase (JAK) inhibitors for inflammatory diseases. J Med Chem57:5023-38 (2014) 
 
Non-receptor tyrosine-protein kinase TYK2/Tyrosine-protein kinase JAK1
Name:Non-receptor tyrosine-protein kinase TYK2/Tyrosine-protein kinase JAK1
Synonyms:JAK1/TYK2
Type:n/a
Mol. Mass.:n/a
Description:ASSAY_ID of ChEMBL is 1368159
Components:This complex has 2 components.
Component 1
Name:Tyrosine-protein kinase JAK1
Type:Protein
Mol. Mass.:133293.73
Organism:Homo sapiens (Human)
Description:P23458
Residue:1154
Component 2
Name:Non-receptor tyrosine-protein kinase TYK2
Synonyms:Non-receptor tyrosine-protein kinase TYK2 (TYK2) TYK2_HUMAN | Tyrosine-protein kinase TYK2
Type:Protein
Mol. Mass.:133666.03
Organism:Homo sapiens (Human)
Description:P29597
Residue:1187
BDBM50193995
NameBDBM50193995
Synonyms:3-((3R,4R)-4-methyl-3-(methyl(7H-pyrrolo[2,3-d]pyrimidin-4-yl)amino)piperidin-1-yl)-3-oxopropanenitrile 3-{(3R,4R)-4-methyl-3-[methyl(7H-pyrrolo[2,3-d]pyrimidin-4-yl)amino]piperidin-1-yl}-3-oxopropanenitrile CP-690550 Tofacitinib US10112907, Example 00035 US10766894, Compound TABLE 1.20 US11078206, Example Tofacitinib US11339167, Example Tofacitinib
TypeSmall organic molecule
Emp. Form.C16H20N6O
Mol. Mass.312.3696
SMILESC[C@@H]1CCN(C[C@@H]1N(C)c1ncnc2[nH]ccc12)C(=O)CC#N