Reaction Details
TargetJAK3/JAK1
LigandBDBM50021656
Substrate/Competitorn/a
Meas. Tech.ChEMBL_1368156 (CHEMBL3299204)
IC50 259±n/a nM
Citation Clark, JDFlanagan, METelliez, JB Discovery and development of Janus kinase (JAK) inhibitors for inflammatory diseases. J Med Chem57:5023-38 (2014) 
 
JAK3/JAK1
Name:JAK3/JAK1
Synonyms:Tyrosine-protein kinase JAK1/JAK3
Type:n/a
Mol. Mass.:n/a
Description:ASSAY_ID of ChEMBL is 2193386
Components:This complex has 2 components.
Component 1
Name:Tyrosine-protein kinase JAK3
Type:Protein
Mol. Mass.:125111.08
Organism:Homo sapiens (Human)
Description:P52333
Residue:1124
Component 2
Name:Tyrosine-protein kinase JAK1
Synonyms:JAK-1 JAK1A JAK1_HUMAN Janus kinase 1 (JAK1) | Janus kinase 1 JAK1
Type:Protein
Mol. Mass.:133293.73
Organism:Homo sapiens (Human)
Description:P23458
Residue:1154
BDBM50021656
NameBDBM50021656
Synonyms:BARICITINIB LY-3009104 US10766894, Compound TABLE 1.19 US11203595, TABLE 1.19 US20230416237, Example baricitinib
TypeSmall organic molecule
Emp. Form.C16H17N7O2S
Mol. Mass.371.417
SMILESCCS(=O)(=O)N1CC(CC#N)(C1)n1cc(cn1)-c1ncnc2[nH]ccc12