Reaction Details
TargetNon-receptor tyrosine-protein kinase TYK2/Tyrosine-protein kinase JAK2
LigandBDBM50021655
Substrate/Competitorn/a
Meas. Tech.ChEMBL_1368158 (CHEMBL3299206)
IC50 16400±n/a nM
Citation Clark, JDFlanagan, METelliez, JB Discovery and development of Janus kinase (JAK) inhibitors for inflammatory diseases. J Med Chem57:5023-38 (2014) 
 
Non-receptor tyrosine-protein kinase TYK2/Tyrosine-protein kinase JAK2
Name:Non-receptor tyrosine-protein kinase TYK2/Tyrosine-protein kinase JAK2
Synonyms:JAK2/TYK2
Type:n/a
Mol. Mass.:n/a
Description:ASSAY_ID of ChEMBL is 1368160
Components:This complex has 2 components.
Component 1
Name:Tyrosine-protein kinase JAK2
Type:Protein
Mol. Mass.:130684.68
Organism:Homo sapiens (Human)
Description:O60674
Residue:1132
Component 2
Name:Non-receptor tyrosine-protein kinase TYK2
Synonyms:Non-receptor tyrosine-protein kinase TYK2 (TYK2) TYK2_HUMAN | Tyrosine-protein kinase TYK2
Type:Protein
Mol. Mass.:133666.03
Organism:Homo sapiens (Human)
Description:P29597
Residue:1187
BDBM50021655
NameBDBM50021655
Synonyms:DECERNOTINIB US10766894, Compound TABLE 1.2 VRT-831509 | VX-509
TypeSmall organic molecule
Emp. Form.C18H19F3N6O
Mol. Mass.392.3783
SMILESCC[C@@](C)(Nc1ccnc(n1)-c1c[nH]c2ncccc12)C(=O)NCC(F)(F)F