Reaction Details
TargetRibosomal protein S6 kinase alpha-3
LigandBDBM50021676
Substrate/Competitorn/a
Meas. Tech.ChEMBL_1368328 (CHEMBL868674)
IC50>20000±n/a nM
Citation Costales, AMathur, MRamurthy, SLan, JSubramanian, SJain, RAtallah, GSetti, LLindvall, MAppleton, BAOrnelas, EFeucht, PWarne, BDoyle, LBasham, SEAronchik, IJefferson, ABShafer, CM 2-Amino-7-substituted benzoxazole analogs as potent RSK2 inhibitors. Bioorg Med Chem Lett24:1592-6 (2014) 
 
Ribosomal protein S6 kinase alpha-3
Name:Ribosomal protein S6 kinase alpha-3
Type:Serine/threonine-protein kinase
Mol. Mass.:83740.03
Organism:Homo sapiens (Human)
Description:The human RSK2 sequence differed from the Genbank entry NM_004586 at one residue, V45G. The protein was cloned and purified from baculovirus expression system.
Residue:740
BDBM50021676
NameBDBM50021676
Synonyms:CHEMBL3298043
TypeSmall organic molecule
Emp. Form.C25H25FN2O5
Mol. Mass.452.4748
SMILESCOc1cc(Nc2nc3cccc(-c4c(F)cccc4OC(C)C)c3o2)cc(OC)c1OC