Reaction Details
TargetIntegrin alpha-L
LigandBDBM50021693
Substrate/Competitorn/a
Meas. Tech.ChEMBL_1368331 (CHEMBL864781)
IC50 100±n/a nM
Citation Kollmann, CSBai, XTsai, CHYang, HLind, KESkinner, SRZhu, ZIsrael, DICuozzo, JWMorgan, BAYuki, KXie, CSpringer, TAShimaoka, MEvindar, G Application of encoded library technology (ELT) to a protein-protein interaction target: discovery of a potent class of integrin lymphocyte function-associated antigen 1 (LFA-1) antagonists. Bioorg Med Chem22:2353-65 (2014) 
 
Integrin alpha-L
Name:Integrin alpha-L
Type:PROTEIN
Mol. Mass.:128748.90
Organism:Homo sapiens (Human)
Description:ChEMBL_629045
Residue:1170
BDBM50021693
NameBDBM50021693
Synonyms:CHEMBL3297752
TypeSmall organic molecule
Emp. Form.C69H77Cl2F3N11O9S2
Mol. Mass.1396.449
SMILESCCN1\C(=C\C=C\C2=[N+](CCCCCC(=O)NCCCCNC(=O)C3(Cc4ccccc4C3)Nc3nc(NCCc4ccc(Cl)c(Cl)c4)nc(n3)N3CC4CC3CN4C(=O)c3cccc(c3)C(F)(F)F)c3ccc(cc3C2(C)C)S(O)(=O)=O)C(C)(C)c2cc(ccc12)S(O)(=O)=O