Reaction Details
TargetIntegrin alpha-L
LigandBDBM50021696
Substrate/Competitorn/a
Meas. Tech.ChEMBL_1368331 (CHEMBL864781)
IC50 117±n/a nM
Citation Kollmann, CSBai, XTsai, CHYang, HLind, KESkinner, SRZhu, ZIsrael, DICuozzo, JWMorgan, BAYuki, KXie, CSpringer, TAShimaoka, MEvindar, G Application of encoded library technology (ELT) to a protein-protein interaction target: discovery of a potent class of integrin lymphocyte function-associated antigen 1 (LFA-1) antagonists. Bioorg Med Chem22:2353-65 (2014) 
 
Integrin alpha-L
Name:Integrin alpha-L
Type:PROTEIN
Mol. Mass.:128748.90
Organism:Homo sapiens (Human)
Description:ChEMBL_629045
Residue:1170
BDBM50021696
NameBDBM50021696
Synonyms:CHEMBL3298196
TypeSmall organic molecule
Emp. Form.C35H36BrF3N8O4S
Mol. Mass.801.676
SMILESCCNC(=O)C1(Cc2ccccc2C1)Nc1nc(N[C@@H](C)c2ccc(Br)cc2)nc(n1)N1CC2CC1CN2S(=O)(=O)c1ccccc1OC(F)(F)F