Reaction Details
TargetIntegrin alpha-L
LigandBDBM50021699
Substrate/Competitorn/a
Meas. Tech.ChEMBL_1368331 (CHEMBL864781)
IC50 12900±n/a nM
Citation Kollmann, CSBai, XTsai, CHYang, HLind, KESkinner, SRZhu, ZIsrael, DICuozzo, JWMorgan, BAYuki, KXie, CSpringer, TAShimaoka, MEvindar, G Application of encoded library technology (ELT) to a protein-protein interaction target: discovery of a potent class of integrin lymphocyte function-associated antigen 1 (LFA-1) antagonists. Bioorg Med Chem22:2353-65 (2014) 
 
Integrin alpha-L
Name:Integrin alpha-L
Type:PROTEIN
Mol. Mass.:128748.90
Organism:Homo sapiens (Human)
Description:ChEMBL_629045
Residue:1170
BDBM50021699
NameBDBM50021699
Synonyms:CHEMBL3298405
TypeSmall organic molecule
Emp. Form.C27H31Cl2N7O
Mol. Mass.540.487
SMILESCCNC(=O)C1(Cc2ccccc2C1)Nc1nc(NCCc2ccc(Cl)c(Cl)c2)nc(n1)N1CCCC1