Reaction Details
TargetEpidermal growth factor receptor
LigandBDBM50428420
Substrate/Competitorn/a
Meas. Tech.ChEMBL_1368552 (CHEMBL3300694)
IC50>10000±n/a nM
Citation Marzaro, GColuccia, AFerrarese, ABrun, PCastagliuolo, IConconi, MTLa Regina, GBai, RSilvestri, RHamel, EChilin, A Discovery of biarylaminoquinazolines as novel tubulin polymerization inhibitors. J Med Chem57:4598-605 (2014) 
 
Epidermal growth factor receptor
Name:Epidermal growth factor receptor
Type:Receptor Kinase Domain
Mol. Mass.:134279.59
Organism:Homo sapiens (Human)
Description:P00533
Residue:1210
BDBM50428420
NameBDBM50428420
Synonyms:CHEMBL2333991
TypeSmall organic molecule
Emp. Form.C22H19N3O2
Mol. Mass.357.4052
SMILESCOc1cc2ncnc(Nc3cccc(c3)-c3ccccc3)c2cc1OC