Reaction Details
TargetFibroblast growth factor receptor 1
LigandBDBM50439335
Substrate/Competitorn/a
Meas. Tech.ChEMBL_1368553 (CHEMBL3300695)
IC50 63±n/a nM
Citation Marzaro, GColuccia, AFerrarese, ABrun, PCastagliuolo, IConconi, MTLa Regina, GBai, RSilvestri, RHamel, EChilin, A Discovery of biarylaminoquinazolines as novel tubulin polymerization inhibitors. J Med Chem57:4598-605 (2014) 
 
Fibroblast growth factor receptor 1
Name:Fibroblast growth factor receptor 1
Type:Receptor
Mol. Mass.:91861.70
Organism:Homo sapiens (Human)
Description:P11362
Residue:822
BDBM50439335
NameBDBM50439335
Synonyms:CHEMBL2419760
TypeSmall organic molecule
Emp. Form.C21H15N3O2
Mol. Mass.341.3627
SMILESC1Oc2cc3ncnc(Nc4cccc(c4)-c4ccccc4)c3cc2O1