Reaction Details
TargetFibroblast growth factor receptor 1
LigandBDBM50439334
Substrate/Competitorn/a
Meas. Tech.ChEMBL_1368553 (CHEMBL3300695)
IC50 178±n/a nM
Citation Marzaro, GColuccia, AFerrarese, ABrun, PCastagliuolo, IConconi, MTLa Regina, GBai, RSilvestri, RHamel, EChilin, A Discovery of biarylaminoquinazolines as novel tubulin polymerization inhibitors. J Med Chem57:4598-605 (2014) 
 
Fibroblast growth factor receptor 1
Name:Fibroblast growth factor receptor 1
Type:Receptor
Mol. Mass.:91861.70
Organism:Homo sapiens (Human)
Description:P11362
Residue:822
BDBM50439334
NameBDBM50439334
Synonyms:CHEMBL2419761
TypeSmall organic molecule
Emp. Form.C22H17N3O2
Mol. Mass.355.3893
SMILESC1COc2cc3c(Nc4cccc(c4)-c4ccccc4)ncnc3cc2O1