Reaction Details
TargetTyrosine-protein kinase ABL1
LigandBDBM50021702
Substrate/Competitorn/a
Meas. Tech.ChEMBL_1368554 (CHEMBL3300696)
IC50>10000±n/a nM
Citation Marzaro, GColuccia, AFerrarese, ABrun, PCastagliuolo, IConconi, MTLa Regina, GBai, RSilvestri, RHamel, EChilin, A Discovery of biarylaminoquinazolines as novel tubulin polymerization inhibitors. J Med Chem57:4598-605 (2014) 
 
Tyrosine-protein kinase ABL1
Name:Tyrosine-protein kinase ABL1
Type:Enzyme
Mol. Mass.:122897.30
Organism:Homo sapiens (Human)
Description:P00519
Residue:1130
BDBM50021702
NameBDBM50021702
Synonyms:CHEMBL3297955
TypeSmall organic molecule
Emp. Form.C20H16ClN3O2S
Mol. Mass.397.878
SMILESCl.C1COc2cc3c(Nc4cccc(c4)-c4cccs4)ncnc3cc2O1