Reaction Details
TargetProto-oncogene tyrosine-protein kinase Src
LigandBDBM50439333
Substrate/Competitorn/a
Meas. Tech.ChEMBL_1368555 (CHEMBL3300697)
IC50 645±n/a nM
Citation Marzaro, GColuccia, AFerrarese, ABrun, PCastagliuolo, IConconi, MTLa Regina, GBai, RSilvestri, RHamel, EChilin, A Discovery of biarylaminoquinazolines as novel tubulin polymerization inhibitors. J Med Chem57:4598-605 (2014) 
 
Proto-oncogene tyrosine-protein kinase Src
Name:Proto-oncogene tyrosine-protein kinase Src
Type:Protein
Mol. Mass.:59838.60
Organism:Homo sapiens (Human)
Description:P12931
Residue:536
BDBM50439333
NameBDBM50439333
Synonyms:CHEMBL2419762
TypeSmall organic molecule
Emp. Form.C23H19N3O2
Mol. Mass.369.4159
SMILESC1COc2cc3ncnc(Nc4cccc(c4)-c4ccccc4)c3cc2OC1