Reaction Details
TargetMitogen-activated protein kinase 1
LigandBDBM50021713
Substrate/Competitorn/a
Meas. Tech.ChEMBL_1368653
IC50 14±n/a nM
Citation Blake, JFGaudino, JJDe Meese, JMohr, PChicarelli, MTian, HGarrey, RThomas, ASiedem, CSWelch, MBKolakowski, GKaus, RBurkard, MMartinson, MChen, HDean, BDudley, DAGould, SEPacheco, PShahidi-Latham, SWang, WWest, KYin, JMoffat, JSchwarz, JB Discovery of 5,6,7,8-tetrahydropyrido[3,4-d]pyrimidine inhibitors of Erk2. Bioorg Med Chem Lett24:2635-9 (2014) 
 
Mitogen-activated protein kinase 1
Name:Mitogen-activated protein kinase 1
Type:Ser/Thr Protein Kinase
Mol. Mass.:41392.76
Organism:Homo sapiens (Human)
Description:P28482
Residue:360
BDBM50021713
NameBDBM50021713
Synonyms:CHEMBL3298312
TypeSmall organic molecule
Emp. Form.C21H28ClN5O3
Mol. Mass.433.932
SMILESCC[C@@H](NC(=O)N1CCc2cnc(N[C@@H](C)CO)nc2C1)c1ccc(OC)c(Cl)c1