Reaction Details
TargetMitogen-activated protein kinase 1
LigandBDBM50021724
Substrate/Competitorn/a
Meas. Tech.ChEMBL_1368652
IC50 69±n/a nM
Citation Blake, JFGaudino, JJDe Meese, JMohr, PChicarelli, MTian, HGarrey, RThomas, ASiedem, CSWelch, MBKolakowski, GKaus, RBurkard, MMartinson, MChen, HDean, BDudley, DAGould, SEPacheco, PShahidi-Latham, SWang, WWest, KYin, JMoffat, JSchwarz, JB Discovery of 5,6,7,8-tetrahydropyrido[3,4-d]pyrimidine inhibitors of Erk2. Bioorg Med Chem Lett24:2635-9 (2014) 
 
Mitogen-activated protein kinase 1
Name:Mitogen-activated protein kinase 1
Type:Ser/Thr Protein Kinase
Mol. Mass.:41392.76
Organism:Homo sapiens (Human)
Description:P28482
Residue:360
BDBM50021724
NameBDBM50021724
Synonyms:CHEMBL3298672
TypeSmall organic molecule
Emp. Form.C18H22FN5O
Mol. Mass.343.3986
SMILESCC(C)Nc1ncc2CCN(Cc2n1)C(=O)NCc1ccc(F)cc1