Reaction Details
TargetMitogen-activated protein kinase 1
LigandBDBM50021709
Substrate/Competitorn/a
Meas. Tech.ChEMBL_1368652
IC50 1.000000±n/a nM
Citation Blake, JFGaudino, JJDe Meese, JMohr, PChicarelli, MTian, HGarrey, RThomas, ASiedem, CSWelch, MBKolakowski, GKaus, RBurkard, MMartinson, MChen, HDean, BDudley, DAGould, SEPacheco, PShahidi-Latham, SWang, WWest, KYin, JMoffat, JSchwarz, JB Discovery of 5,6,7,8-tetrahydropyrido[3,4-d]pyrimidine inhibitors of Erk2. Bioorg Med Chem Lett24:2635-9 (2014) 
 
Mitogen-activated protein kinase 1
Name:Mitogen-activated protein kinase 1
Type:Ser/Thr Protein Kinase
Mol. Mass.:41392.76
Organism:Homo sapiens (Human)
Description:P28482
Residue:360
BDBM50021709
NameBDBM50021709
Synonyms:CHEMBL3298308
TypeSmall organic molecule
Emp. Form.C19H23Cl2N5O2
Mol. Mass.424.324
SMILESC[C@@H](CO)Nc1ncc2CCN(Cc2n1)C(=O)N[C@H](C)c1ccc(Cl)c(Cl)c1