Reaction Details
TargetMitogen-activated protein kinase 1
LigandBDBM50021735
Substrate/Competitorn/a
Meas. Tech.ChEMBL_1368653
IC50 2109±n/a nM
Citation Blake, JFGaudino, JJDe Meese, JMohr, PChicarelli, MTian, HGarrey, RThomas, ASiedem, CSWelch, MBKolakowski, GKaus, RBurkard, MMartinson, MChen, HDean, BDudley, DAGould, SEPacheco, PShahidi-Latham, SWang, WWest, KYin, JMoffat, JSchwarz, JB Discovery of 5,6,7,8-tetrahydropyrido[3,4-d]pyrimidine inhibitors of Erk2. Bioorg Med Chem Lett24:2635-9 (2014) 
 
Mitogen-activated protein kinase 1
Name:Mitogen-activated protein kinase 1
Type:Ser/Thr Protein Kinase
Mol. Mass.:41392.76
Organism:Homo sapiens (Human)
Description:P28482
Residue:360
BDBM50021735
NameBDBM50021735
Synonyms:CHEMBL3297854
TypeSmall organic molecule
Emp. Form.C22H29ClFN5O3
Mol. Mass.465.949
SMILESCOCCOC[C@@H](NC(=O)N1CCc2cnc(NC(C)C)nc2C1)c1ccc(F)c(Cl)c1