Reaction Details
TargetMitogen-activated protein kinase 1
LigandBDBM50021762
Substrate/Competitorn/a
Meas. Tech.ChEMBL_1368653
IC50 13238±n/a nM
Citation Blake, JFGaudino, JJDe Meese, JMohr, PChicarelli, MTian, HGarrey, RThomas, ASiedem, CSWelch, MBKolakowski, GKaus, RBurkard, MMartinson, MChen, HDean, BDudley, DAGould, SEPacheco, PShahidi-Latham, SWang, WWest, KYin, JMoffat, JSchwarz, JB Discovery of 5,6,7,8-tetrahydropyrido[3,4-d]pyrimidine inhibitors of Erk2. Bioorg Med Chem Lett24:2635-9 (2014) 
 
Mitogen-activated protein kinase 1
Name:Mitogen-activated protein kinase 1
Type:Ser/Thr Protein Kinase
Mol. Mass.:41392.76
Organism:Homo sapiens (Human)
Description:P28482
Residue:360
BDBM50021762
NameBDBM50021762
Synonyms:CHEMBL3298567 | US9133187, II-34
TypeSmall organic molecule
Emp. Form.C21H22ClFN6O3
Mol. Mass.460.889
SMILESCc1noc(C)c1Nc1ncc2CCN(Cc2n1)C(=O)N[C@H](CO)c1ccc(F)c(Cl)c1