Reaction Details
TargetD(2) dopamine receptor
LigandBDBM50021796
Substrate/Competitorn/a
Meas. Tech.ChEMBL_1369049 (CHEMBL3300162)
Ki 16±n/a nM
Citation Szabo, MKlein Herenbrink, CChristopoulos, ALane, JRCapuano, B Structure-activity relationships of privileged structures lead to the discovery of novel biased ligands at the dopamine D2 receptor. J Med Chem57:4924-39 (2014) 
 
D(2) dopamine receptor
Name:D(2) dopamine receptor
Type:Cell-surface receptors
Mol. Mass.:50647.10
Organism:Homo sapiens (Human)
Description:P14416
Residue:443
BDBM50021796
NameBDBM50021796
Synonyms:CHEMBL3299094
TypeSmall organic molecule
Emp. Form.C19H31N3O3
Mol. Mass.349.4677
SMILESCOc1ccccc1N1CCN(CCCNC(=O)OC(C)(C)C)CC1