Reaction Details
TargetTransient receptor potential cation channel subfamily A member 1
LigandBDBM50021821
Substrate/Competitorn/a
Meas. Tech.ChEMBL_1369154 (CHEMBL3300585)
IC50 320±n/a nM
Citation Hu, YJSt-Onge, MLaliberté, SVallée, FJin, SBedard, LLabrecque, JAlbert, JS Discovery of a 4-aryloxy-1H-pyrrolo[3,2-c]pyridine and a 1-aryloxyisoquinoline series of TRPA1 antagonists. Bioorg Med Chem Lett24:3199-203 (2014) 
 
Transient receptor potential cation channel subfamily A member 1
Name:Transient receptor potential cation channel subfamily A member 1
Type:Protein
Mol. Mass.:127514.20
Organism:Homo sapiens (Human)
Description:O75762
Residue:1119
BDBM50021821
NameBDBM50021821
Synonyms:CHEMBL3298760
TypeSmall organic molecule
Emp. Form.C13H8F2N2O
Mol. Mass.246.2122
SMILESFc1ccc(Oc2nccc3[nH]ccc23)c(F)c1