Reaction Details
TargetBeta-2 adrenergic receptor
LigandBDBM50021867
Substrate/Competitorn/a
Meas. Tech.ChEMBL_1369174 (CHEMBL862902)
Ki 13±n/a nM
Citation McKinnell, RMKlein, ULinsell, MSMoran, EJNodwell, MBPfeiffer, JWThomas, GRYu, CJacobsen, JR Discovery of TD-4306, a long-actingß2-agonist for the treatment of asthma and COPD. Bioorg Med Chem Lett24:2871-6 (2014) 
 
Beta-2 adrenergic receptor
Name:Beta-2 adrenergic receptor
Type:n/a
Mol. Mass.:46461.69
Organism:Homo sapiens (Human)
Description:P07550
Residue:413
BDBM50021867
NameBDBM50021867
Synonyms:CHEMBL3298327
TypeSmall organic molecule
Emp. Form.C27H29N3O4
Mol. Mass.459.5369
SMILESCCOc1ccc(Nc2ccc(CCNC[C@H](O)c3ccc(O)c4[nH]c(=O)ccc34)cc2)cc1