Reaction Details
TargetBeta-2 adrenergic receptor
LigandBDBM50021881
Substrate/Competitorn/a
Meas. Tech.ChEMBL_1369174 (CHEMBL862902)
Ki 10.0±n/a nM
Citation McKinnell, RMKlein, ULinsell, MSMoran, EJNodwell, MBPfeiffer, JWThomas, GRYu, CJacobsen, JR Discovery of TD-4306, a long-actingß2-agonist for the treatment of asthma and COPD. Bioorg Med Chem Lett24:2871-6 (2014) 
 
Beta-2 adrenergic receptor
Name:Beta-2 adrenergic receptor
Type:n/a
Mol. Mass.:46461.69
Organism:Homo sapiens (Human)
Description:P07550
Residue:413
BDBM50021881
NameBDBM50021881
Synonyms:CHEMBL3298762
TypeSmall organic molecule
Emp. Form.C34H34N4O5
Mol. Mass.578.6576
SMILESO[C@@H](CNCCc1ccc(Nc2ccc(OCCNC(=O)c3ccccc3)cc2)cc1)c1ccc(O)c2[nH]c(=O)ccc12