Reaction Details
TargetBeta-2 adrenergic receptor
LigandBDBM50021868
Substrate/Competitorn/a
Meas. Tech.ChEMBL_1369177
EC50 0.100000±n/a nM
Citation McKinnell, RMKlein, ULinsell, MSMoran, EJNodwell, MBPfeiffer, JWThomas, GRYu, CJacobsen, JR Discovery of TD-4306, a long-actingß2-agonist for the treatment of asthma and COPD. Bioorg Med Chem Lett24:2871-6 (2014) 
 
Beta-2 adrenergic receptor
Name:Beta-2 adrenergic receptor
Type:n/a
Mol. Mass.:46461.69
Organism:Homo sapiens (Human)
Description:P07550
Residue:413
BDBM50021868
NameBDBM50021868
Synonyms:CHEMBL3298328
TypeSmall organic molecule
Emp. Form.C27H30N4O4
Mol. Mass.474.5515
SMILESNCCOc1ccc(Nc2ccc(CCNC[C@H](O)c3ccc(O)c4[nH]c(=O)ccc34)cc2)cc1