Reaction Details
TargetBeta-2 adrenergic receptor
LigandBDBM50021865
Substrate/Competitorn/a
Meas. Tech.ChEMBL_1369174 (CHEMBL862902)
Ki 1.6±n/a nM
Citation McKinnell, RMKlein, ULinsell, MSMoran, EJNodwell, MBPfeiffer, JWThomas, GRYu, CJacobsen, JR Discovery of TD-4306, a long-actingß2-agonist for the treatment of asthma and COPD. Bioorg Med Chem Lett24:2871-6 (2014) 
 
Beta-2 adrenergic receptor
Name:Beta-2 adrenergic receptor
Type:n/a
Mol. Mass.:46461.69
Organism:Homo sapiens (Human)
Description:P07550
Residue:413
BDBM50021865
NameBDBM50021865
Synonyms:CHEMBL3298325
TypeSmall organic molecule
Emp. Form.C33H34N4O4
Mol. Mass.550.6475
SMILESCOc1ccc(Nc2ccc(CCNC[C@H](O)c3ccc(O)c4[nH]c(=O)ccc34)cc2)cc1-c1cccc(CN)c1