Reaction Details
TargetMuscarinic acetylcholine receptor M1
LigandBDBM50021893
Substrate/Competitorn/a
Meas. Tech.ChEMBL_1367094
Ki 0.330000±n/a nM
Citation Nagashima, SMatsushima, YHamaguchi, HNagata, HKontani, TMoritomo, AKoshika, TTakeuchi, M Novel quinuclidinyl heteroarylcarbamate derivatives as muscarinic receptor antagonists. Bioorg Med Chem22:3478-87 (2014) 
 
Muscarinic acetylcholine receptor M1
Name:Muscarinic acetylcholine receptor M1
Type:Enzyme Catalytic Domain
Mol. Mass.:51390.46
Organism:RAT
Description:P08482
Residue:460
BDBM50021893
NameBDBM50021893
Synonyms:CHEMBL3298333
TypeSmall organic molecule
Emp. Form.C18H20N2O2S
Mol. Mass.328.429
SMILESO=C(Nc1sccc1-c1ccccc1)OC12CCN(CC1)CC2