Reaction Details
TargetMuscarinic acetylcholine receptor M1
LigandBDBM50021909
Substrate/Competitorn/a
Meas. Tech.ChEMBL_1367094
Ki 0.390000±n/a nM
Citation Nagashima, SMatsushima, YHamaguchi, HNagata, HKontani, TMoritomo, AKoshika, TTakeuchi, M Novel quinuclidinyl heteroarylcarbamate derivatives as muscarinic receptor antagonists. Bioorg Med Chem22:3478-87 (2014) 
 
Muscarinic acetylcholine receptor M1
Name:Muscarinic acetylcholine receptor M1
Type:Enzyme Catalytic Domain
Mol. Mass.:51390.46
Organism:RAT
Description:P08482
Residue:460
BDBM50021909
NameBDBM50021909
Synonyms:CHEMBL3298591
TypeSmall organic molecule
Emp. Form.C17H19N3O2S
Mol. Mass.329.417
SMILESO=C(Nc1ncsc1-c1ccccc1)OC12CCN(CC1)CC2