Reaction Details
TargetMuscarinic acetylcholine receptor M1
LigandBDBM50021922
Substrate/Competitorn/a
Meas. Tech.ChEMBL_1367094
Ki 0.055000±n/a nM
Citation Nagashima, SMatsushima, YHamaguchi, HNagata, HKontani, TMoritomo, AKoshika, TTakeuchi, M Novel quinuclidinyl heteroarylcarbamate derivatives as muscarinic receptor antagonists. Bioorg Med Chem22:3478-87 (2014) 
 
Muscarinic acetylcholine receptor M1
Name:Muscarinic acetylcholine receptor M1
Type:Enzyme Catalytic Domain
Mol. Mass.:51390.46
Organism:RAT
Description:P08482
Residue:460
BDBM50021922
NameBDBM50021922
Synonyms:CHEMBL3298596
TypeSmall organic molecule
Emp. Form.C18H22IN3O2S
Mol. Mass.471.356
SMILES[I-].C[N+]12CCC(CC1)(CC2)OC(=O)Nc1ncsc1-c1ccccc1