Reaction Details
TargetMuscarinic acetylcholine receptor M2
LigandBDBM50021901
Substrate/Competitorn/a
Meas. Tech.ChEMBL_1367095
Ki 3.6±n/a nM
Citation Nagashima, SMatsushima, YHamaguchi, HNagata, HKontani, TMoritomo, AKoshika, TTakeuchi, M Novel quinuclidinyl heteroarylcarbamate derivatives as muscarinic receptor antagonists. Bioorg Med Chem22:3478-87 (2014) 
 
Muscarinic acetylcholine receptor M2
Name:Muscarinic acetylcholine receptor M2
Type:Enzyme Catalytic Domain
Mol. Mass.:51555.53
Organism:RAT
Description:P10980
Residue:466
BDBM50021901
NameBDBM50021901
Synonyms:CHEMBL3298334
TypeSmall organic molecule
Emp. Form.C18H21ClN2O2S
Mol. Mass.364.89
SMILESCl.O=C(Nc1cscc1-c1ccccc1)OC12CCN(CC1)CC2