Reaction Details
TargetMuscarinic acetylcholine receptor M3
LigandBDBM50021909
Substrate/Competitorn/a
Meas. Tech.ChEMBL_1367096
Ki 0.200000±n/a nM
Citation Nagashima, SMatsushima, YHamaguchi, HNagata, HKontani, TMoritomo, AKoshika, TTakeuchi, M Novel quinuclidinyl heteroarylcarbamate derivatives as muscarinic receptor antagonists. Bioorg Med Chem22:3478-87 (2014) 
 
Muscarinic acetylcholine receptor M3
Name:Muscarinic acetylcholine receptor M3
Type:Enzyme Catalytic Domain
Mol. Mass.:66086.66
Organism:RAT
Description:Cholinergic, muscarinic M3 CHRM3 RAT::P08483
Residue:589
BDBM50021909
NameBDBM50021909
Synonyms:CHEMBL3298591
TypeSmall organic molecule
Emp. Form.C17H19N3O2S
Mol. Mass.329.417
SMILESO=C(Nc1ncsc1-c1ccccc1)OC12CCN(CC1)CC2