Reaction Details
TargetMuscarinic acetylcholine receptor M3
LigandBDBM50021938
Substrate/Competitorn/a
Meas. Tech.ChEMBL_1367096
Ki 0.120000±n/a nM
Citation Nagashima, SMatsushima, YHamaguchi, HNagata, HKontani, TMoritomo, AKoshika, TTakeuchi, M Novel quinuclidinyl heteroarylcarbamate derivatives as muscarinic receptor antagonists. Bioorg Med Chem22:3478-87 (2014) 
 
Muscarinic acetylcholine receptor M3
Name:Muscarinic acetylcholine receptor M3
Type:Enzyme Catalytic Domain
Mol. Mass.:66086.66
Organism:RAT
Description:Cholinergic, muscarinic M3 CHRM3 RAT::P08483
Residue:589
BDBM50021938
NameBDBM50021938
Synonyms:CHEMBL3298763
TypeSmall organic molecule
Emp. Form.C18H20Cl2IN3O2S
Mol. Mass.540.246
SMILES[I-].C[N+]12CCC(CC1)(CC2)OC(=O)Nc1ncsc1-c1cc(Cl)cc(Cl)c1