Reaction Details
TargetKappa-type opioid receptor
LigandBDBM50021991
Substrate/Competitorn/a
Meas. Tech.ChEMBL_1367235
Ki 2.1±n/a nM
Citation Bourgeois, CWerfel, ESchepmann, DWünsch, B Combination of cyclohexane and piperazine based¿-opioid receptor agonists: Synthesis and pharmacological evaluation of trans,trans-configured perhydroquinoxalines. Bioorg Med Chem22:3316-24 (2014) 
 
Kappa-type opioid receptor
Name:Kappa-type opioid receptor
Type:G Protein-Coupled Receptor (GPCR)
Mol. Mass.:42744.99
Organism:Cavia porcellus (domestic guinea pig)
Description:P41144
Residue:380
BDBM50021991
NameBDBM50021991
Synonyms:CHEMBL3299004
TypeSmall organic molecule
Emp. Form.C20H27Cl2N3O
Mol. Mass.396.354
SMILES[H][C@@]12CCC[C@H](N3CCCC3)[C@@]1([H])N(CCN2)C(=O)Cc1ccc(Cl)c(Cl)c1