Reaction Details
TargetMu-type opioid receptor
LigandBDBM50021991
Substrate/Competitorn/a
Meas. Tech.ChEMBL_1367238
IC50>10000±n/a nM
Citation Bourgeois, CWerfel, ESchepmann, DWünsch, B Combination of cyclohexane and piperazine based¿-opioid receptor agonists: Synthesis and pharmacological evaluation of trans,trans-configured perhydroquinoxalines. Bioorg Med Chem22:3316-24 (2014) 
 
Mu-type opioid receptor
Name:Mu-type opioid receptor
Type:G Protein-Coupled Receptor (GPCR)
Mol. Mass.:44789.51
Organism:Homo sapiens (Human)
Description:P35372
Residue:400
BDBM50021991
NameBDBM50021991
Synonyms:CHEMBL3299004
TypeSmall organic molecule
Emp. Form.C20H27Cl2N3O
Mol. Mass.396.354
SMILES[H][C@@]12CCC[C@H](N3CCCC3)[C@@]1([H])N(CCN2)C(=O)Cc1ccc(Cl)c(Cl)c1