Reaction Details
TargetKappa-type opioid receptor
LigandBDBM50021987
Substrate/Competitorn/a
Meas. Tech.ChEMBL_1367244
EC50 490±n/a nM
Citation Bourgeois, CWerfel, ESchepmann, DWünsch, B Combination of cyclohexane and piperazine based¿-opioid receptor agonists: Synthesis and pharmacological evaluation of trans,trans-configured perhydroquinoxalines. Bioorg Med Chem22:3316-24 (2014) 
 
Kappa-type opioid receptor
Name:Kappa-type opioid receptor
Type:G Protein-Coupled Receptor (GPCR)
Mol. Mass.:42648.76
Organism:Homo sapiens (Human)
Description:P41145
Residue:380
BDBM50021987
NameBDBM50021987
Synonyms:CHEMBL3299002
TypeSmall organic molecule
Emp. Form.C27H33Cl2N3O
Mol. Mass.486.476
SMILES[H][C@@]12CCC[C@H](N3CCCC3)[C@@]1([H])N(CCN2Cc1ccccc1)C(=O)Cc1ccc(Cl)c(Cl)c1