Reaction Details
TargetCytochrome P450 3A4
LigandBDBM50022084
Substrate/Competitorn/a
Meas. Tech.ChEMBL_1367425 (CHEMBL3300779)
IC50>40000±n/a nM
Citation Kang, SKim, RYSeo, MJLee, SKim, YMSeo, MSeo, JJKo, YChoi, IJang, JNam, JPark, SKang, HKim, HJKim, JAhn, SPethe, KNam, KNo, ZKim, J Lead optimization of a novel series of imidazo[1,2-a]pyridine amides leading to a clinical candidate (Q203) as a multi- and extensively-drug-resistant anti-tuberculosis agent. J Med Chem57:5293-305 (2014) 
 
Cytochrome P450 3A4
Name:Cytochrome P450 3A4
Type:Enzyme
Mol. Mass.:57349.57
Organism:Homo sapiens (Human)
Description:n/a
Residue:503
BDBM50022084
NameBDBM50022084
Synonyms:CHEMBL3298908
TypeSmall organic molecule
Emp. Form.C28H28Cl2N4O
Mol. Mass.507.454
SMILESCCc1nc2ccc(Cl)cn2c1C(=O)NCc1ccc(cc1)N1CCC(CC1)c1ccc(Cl)cc1