Reaction Details
TargetCytochrome P450 3A4
LigandBDBM50022086
Substrate/Competitorn/a
Meas. Tech.ChEMBL_1367425 (CHEMBL3300779)
IC50>100000±n/a nM
Citation Kang, SKim, RYSeo, MJLee, SKim, YMSeo, MSeo, JJKo, YChoi, IJang, JNam, JPark, SKang, HKim, HJKim, JAhn, SPethe, KNam, KNo, ZKim, J Lead optimization of a novel series of imidazo[1,2-a]pyridine amides leading to a clinical candidate (Q203) as a multi- and extensively-drug-resistant anti-tuberculosis agent. J Med Chem57:5293-305 (2014) 
 
Cytochrome P450 3A4
Name:Cytochrome P450 3A4
Type:Enzyme
Mol. Mass.:57349.57
Organism:Homo sapiens (Human)
Description:n/a
Residue:503
BDBM50022086
NameBDBM50022086
Synonyms:6-chloro-2-ethyl-N-(4-(4-(4-(trifluoromethoxy)phenyl)piperidin-1-yl)benzyl) imidazo(1,2-a)pyridine-3-carboxamide Q203 | Telacebec
TypeSmall organic molecule
Emp. Form.C29H28ClF3N4O2
Mol. Mass.557.006
SMILESCCc1nc2ccc(Cl)cn2c1C(=O)NCc1ccc(cc1)N1CCC(CC1)c1ccc(OC(F)(F)F)cc1