Reaction Details
TargetCytochrome P450 2D6
LigandBDBM50022079
Substrate/Competitorn/a
Meas. Tech.ChEMBL_1367426 (CHEMBL3300780)
IC50>40000±n/a nM
Citation Kang, SKim, RYSeo, MJLee, SKim, YMSeo, MSeo, JJKo, YChoi, IJang, JNam, JPark, SKang, HKim, HJKim, JAhn, SPethe, KNam, KNo, ZKim, J Lead optimization of a novel series of imidazo[1,2-a]pyridine amides leading to a clinical candidate (Q203) as a multi- and extensively-drug-resistant anti-tuberculosis agent. J Med Chem57:5293-305 (2014) 
 
Cytochrome P450 2D6
Name:Cytochrome P450 2D6
Type:Protein
Mol. Mass.:55774.82
Organism:Homo sapiens (Human)
Description:P10635
Residue:497
BDBM50022079
NameBDBM50022079
Synonyms:CHEMBL3298836
TypeSmall organic molecule
Emp. Form.C27H27ClFN5O
Mol. Mass.491.988
SMILESCCc1nc2ccc(Cl)cn2c1C(=O)NCc1ccc(cc1)N1CCN(CC1)c1ccc(F)cc1