Reaction Details
TargetCytochrome P450 2D6
LigandBDBM50022080
Substrate/Competitorn/a
Meas. Tech.ChEMBL_1367426 (CHEMBL3300780)
IC50>40000±n/a nM
Citation Kang, SKim, RYSeo, MJLee, SKim, YMSeo, MSeo, JJKo, YChoi, IJang, JNam, JPark, SKang, HKim, HJKim, JAhn, SPethe, KNam, KNo, ZKim, J Lead optimization of a novel series of imidazo[1,2-a]pyridine amides leading to a clinical candidate (Q203) as a multi- and extensively-drug-resistant anti-tuberculosis agent. J Med Chem57:5293-305 (2014) 
 
Cytochrome P450 2D6
Name:Cytochrome P450 2D6
Type:Protein
Mol. Mass.:55774.82
Organism:Homo sapiens (Human)
Description:P10635
Residue:497
BDBM50022080
NameBDBM50022080
Synonyms:CHEMBL3298837
TypeSmall organic molecule
Emp. Form.C28H27ClF3N5O2
Mol. Mass.557.994
SMILESCCc1nc2cc(Cl)ccn2c1C(=O)NCc1ccc(cc1)N1CCN(CC1)c1ccc(OC(F)(F)F)cc1