Reaction Details
TargetCytochrome P450 1A2
LigandBDBM50022083
Substrate/Competitorn/a
Meas. Tech.ChEMBL_1367427 (CHEMBL3300781)
IC50>40000±n/a nM
Citation Kang, SKim, RYSeo, MJLee, SKim, YMSeo, MSeo, JJKo, YChoi, IJang, JNam, JPark, SKang, HKim, HJKim, JAhn, SPethe, KNam, KNo, ZKim, J Lead optimization of a novel series of imidazo[1,2-a]pyridine amides leading to a clinical candidate (Q203) as a multi- and extensively-drug-resistant anti-tuberculosis agent. J Med Chem57:5293-305 (2014) 
 
Cytochrome P450 1A2
Name:Cytochrome P450 1A2
Type:Enzyme
Mol. Mass.:58423.38
Organism:Homo sapiens (Human)
Description:P05177
Residue:516
BDBM50022083
NameBDBM50022083
Synonyms:CHEMBL3298907
TypeSmall organic molecule
Emp. Form.C28H28Cl2N4O
Mol. Mass.507.454
SMILESCCc1nc2cc(Cl)ccn2c1C(=O)NCc1ccc(cc1)N1CCC(CC1)c1ccc(Cl)cc1