Reaction Details
TargetCytochrome P450 2C9
LigandBDBM50022081
Substrate/Competitorn/a
Meas. Tech.ChEMBL_1367428 (CHEMBL3300782)
IC50 570±n/a nM
Citation Kang, SKim, RYSeo, MJLee, SKim, YMSeo, MSeo, JJKo, YChoi, IJang, JNam, JPark, SKang, HKim, HJKim, JAhn, SPethe, KNam, KNo, ZKim, J Lead optimization of a novel series of imidazo[1,2-a]pyridine amides leading to a clinical candidate (Q203) as a multi- and extensively-drug-resistant anti-tuberculosis agent. J Med Chem57:5293-305 (2014) 
 
Cytochrome P450 2C9
Name:Cytochrome P450 2C9
Type:Enzyme
Mol. Mass.:55636.33
Organism:Homo sapiens (Human)
Description:P11712
Residue:490
BDBM50022081
NameBDBM50022081
Synonyms:CHEMBL3298905
TypeSmall organic molecule
Emp. Form.C28H27ClF3N5O2
Mol. Mass.557.994
SMILESCCc1nc2ccc(Cl)cn2c1C(=O)NCc1ccc(cc1)N1CCN(CC1)c1ccc(OC(F)(F)F)cc1