Reaction Details
TargetAmyloid-beta precursor protein
LigandBDBM7459
Substrate/Competitorn/a
Meas. Tech.ChEMBL_1367449
IC50 6400±n/a nM
Citation Churches, QICaine, JCavanagh, KEpa, VCWaddington, LTranberg, CEMeyer, AGVarghese, JNStreltsov, VDuggan, PJ Naturally occurring polyphenolic inhibitors of amyloid beta aggregation. Bioorg Med Chem Lett24:3108-12 (2014) 
 
Amyloid-beta precursor protein
Name:Amyloid-beta precursor protein
Type:Single-pass type I membrane protein
Mol. Mass.:86890.41
Organism:Homo sapiens (Human)
Description:P05067
Residue:770
BDBM7459
NameBDBM7459
Synonyms:2-(3,4-dihydroxyphenyl)-5,7-dihydroxy-4H-chromen-4-one CHEMBL151 Luteolin (4) cid_5280445 med.21724, Compound 3
TypeSmall organic molecule
Emp. Form.C15H10O6
Mol. Mass.286.2363
SMILESOc1cc(O)c2c(c1)oc(cc2=O)-c1ccc(O)c(O)c1